BioAssay Ontology
type: Ontology
license: https://creativecommons.org/licenses/by-sa/4.0/
version info: 2.8.12
label: BAO
comment: Created by: Saminda Abeyruwan, Caty Chung, Hande Küçük McGinty, Janice Kranz, Joseph Ostrow, Alex Clark, Yu Lin, Uma Vempati, Kunie Sakurai, Vance Lemmon, Ubbo Visser, John Turner, Nicolette Ross, Joan Glenny-Pescov, Jiaming Hu, Stephan Schurer*
comment: Contact: Stephan Schurer stephan dot schurer at med dot miami dot edu
date: January 17, 2025

unit of measurement
type: Class
IAO_0000115: It is the definite magnitude of a physical quantity or of time. It has a quantity and a unit associated with it.

log10 molar
type: Class
subclass of: unit of measurement

negative log10 molar
type: Class
subclass of: unit of measurement

counts per second
type: Class
subclass of: unit of measurement

rate
type: Class
IAO_0000119: PubChem AID:
IAO_0000116: Date from BAE: 7/19/2016
subclass of: unit of measurement

cm/sec
type: Class
IAO_0000119: PubChem AID: 602462
IAO_0000116: Date from BAE: 7/6/2016
subclass of: rate

nmol/sec
type: Class
IAO_0000119: PubChem AID: 652113
IAO_0000116: Date from BAE: 7/19/2016
subclass of: rate

log change
type: Class
IAO_0000119: PubChem AID: 2024
IAO_0000116: Date from BAE: 7/21/2016

binary unit
type: Class
IAO_0000119: PubChem AID: 449752
IAO_0000116: Date from BAE: 5/30/16
IAO_0000115: A simple binary assessment, such as 'active/ inactive', 'true/ false', etc.
subclass of: unit of measurement

concentration unit
type: Class
IAO_0000115: It describes the most common unit used in calculating volumetric stoichiometry: molarity. Units include: molar, millimolar, micromolar, nanomolar.
deprecated: true
subclass of: unit of measurement

ratio
type: Class
deprecated: true
subclass of: unit of measurement

temperature unit
type: Class
deprecated: true
subclass of: unit of measurement

time unit
type: Class
deprecated: true
subclass of: unit of measurement

pKi
type: Class
IAO_0000115: Negative base-10 logarithm of KI, the equilibrium dissociation constant (Ki) of an antogonist-receptor complex
subclass of: BAO_0002128

pKd
type: Class
IAO_0000115: Negative base-10 logarithm of a solution's KD (drug affinity dissociation constant)
subclass of: BAO_0002128

pKb
type: Class
IAO_0000115: Negative base-10 logarithm of a solution's base dissociation constant (Kb)
subclass of: BAO_0002128

cells per well
type: Class
deprecated: true
comment: duplicate: cells per microliter (UO_0000316)
has xref: http://purl.obolibrary.org/obo/UO_0000317

cells per microliter
type: Class
comment: duplicate: cells per well (UO_0000317)
has xref: http://purl.obolibrary.org/obo/UO_0000316
deprecated: true