BioAssay Ontology
type: Ontology
license: https://creativecommons.org/licenses/by-sa/4.0/
version info: 2.7.2
label: BAO
comment: Created by: Hande Küçük McGinty, Janice Kranz, Joseph Ostrow, Alex Clark, Yu Lin, Saminda Abeyruwan, Uma Vempati, Kunie Sakurai, Vance Lemmon, Ubbo Visser, John Turner, Stephan Schurer*
comment: Contact: Stephan Schurer stephan dot schurer at gmail dot com
date: 8 Jul 2021

chemist
type: Class
IAO_0000115: A person that performs scientific research and could have the capability of synthesizing new chemical entities.
subclass of: researcher

people
type: Class

researcher
type: Class
subclass of: people