BioAssay Ontology
type: Ontology
license: https://creativecommons.org/licenses/by-sa/4.0/
version info: 2.7.4
label: BAO
comment: Created by: Hande Küçük McGinty, Janice Kranz, Joseph Ostrow, Alex Clark, Yu Lin, Saminda Abeyruwan, Uma Vempati, Kunie Sakurai, Vance Lemmon, Ubbo Visser, John Turner, Nicolette Ross, Joan Glenny-Pescov, Jiaming Hu, Caty Chung, Stephan Schurer*
comment: Contact: Stephan Schurer stephan dot schurer at gmail dot com
date: 10 Nov 2022

ViewLux ultraHTS Microplate Imager
type: Class
subclass of: detection instrument

Infinite F200
type: Class
IAO_0000115: Tecan Infinite F200 is a multifunctional microplate filter-based reader with injector option, that provides high performance for the vast majority of microplate applications and research. It has been designed as a general purpose laboratory instrument for professional use, supporting common 6 to 384-well microplates. (Manufacturer description)
subclass of: detection instrument

detection instrument
type: Class
IAO_0000115: The names of equipment used for measurement/readout from an assay, e.g. FLIPR, ViewLux plate reader, PHERAstar, etc.
subclass of: instrument

8453 UV-Visible Spectrophotometer
type: Class
subclass of: detection instrument

Analyst HT
type: Class
subclass of: detection instrument

ELx808 Absorbance Microplate Reader
type: Class
subclass of: detection instrument

EnVision Multilabel Reader
type: Class
subclass of: detection instrument

FLx800 Fluorescence Microplate Reader
type: Class
subclass of: detection instrument

HTFC Screening System
type: Class
subclass of: detection instrument

PHERAstar Plus
type: Class
subclass of: detection instrument

SpectraMax M5 Multi-Mode Microplate Reader
type: Class
subclass of: detection instrument

VICTOR X2 Multilabel Plate Reader
type: Class
subclass of: detection instrument

VP-ITC Isothermal Titration Calorimeter
type: Class
subclass of: detection instrument

Packard Fusion Microplate Reader
type: Class
subclass of: detection instrument

Infinite PF200
type: Class
subclass of: detection instrument

Monolight 2010 Luminometer
type: Class
subclass of: detection instrument

API 4000 LC/MS/MS System
type: Class
subclass of: detection instrument

AxioVert 200M Fluorescence Light Microscope
type: Class
subclass of: detection instrument

CCD Luminometer
type: Class
subclass of: detection instrument

FDSS6000
type: Class
subclass of: detection instrument

FDSS7000
type: Class
subclass of: detection instrument

FlexStation II Microplate Reader
type: Class
subclass of: detection instrument

FLIPR TETRA
type: Class
subclass of: detection instrument

Fluorometer
type: Class
subclass of: detection instrument

HyperCyt High Throughput Flow Cytometry System
type: Class
subclass of: detection instrument

Mx3005P qPCR System
type: Class
subclass of: detection instrument

Odyssey Infrared Imager
type: Class
subclass of: detection instrument

SpectraMax 190 Microplate Reader
type: Class
subclass of: detection instrument

TopCount NXT Microplate Scintillation Luminescence Counter
type: Class
subclass of: detection instrument

VICTOR X3 Multilabel Plate Reader
type: Class
subclass of: detection instrument

ViewLux CCD Imager
type: Class
subclass of: detection instrument

Wallac MicroBeta Liquid Scintillation Counter
type: Class
subclass of: detection instrument

fluorescence microscope filter
type: Class
IAO_0000115: This categorizes the devices that selectively transmit light in a particular range of wavelengths, including excitation and emission filters. For optimal results, the distance between the wavelengths of the excitation and emission filter should be more than 85% of the sum of both filters bandwidths.
subclass of: instrument

excitation filter
type: Class
IAO_0000115: An excitation filter is an optical-glass filter used in fluorescence microscopy for selection of the excitation wavelength of light from a light source.
subclass of: fluorescence microscope filter

emission filter
type: Class
IAO_0000115: An emission filter is an optical-glass filter used in fluorescence microscopy for selection of the emission wavelength of light from a fluorescent molecule, e.g., fluorophore or dye.
subclass of: fluorescence microscope filter

ICRM12000 atomic absorption spectrometer
type: Class
subclass of: detection instrument

Sector imager 6000
type: Class
subclass of: detection instrument

LabChip EZ Reader
type: Class
subclass of: detection instrument

Epic reader
type: Class
subclass of: detection instrument

Applied biosystems 8200
type: Class
subclass of: detection instrument

AlphaQuest reader
type: Class
subclass of: detection instrument

LJL reader
type: Class
subclass of: detection instrument

IonWorks Quattro
type: Class
subclass of: detection instrument

RapidFire Mass Spec
type: Class
subclass of: detection instrument

Tecan Ultra
type: Class
subclass of: detection instrument

Avance III
type: Class
subclass of: detection instrument

CyAn Flow Cytometer
type: Class
subclass of: detection instrument

MSD SECTOR instrument
type: Class
subclass of: detection instrument

AMINCO-Bowman Series 2 Luminescence Spectrometer
type: Class
subclass of: detection instrument

HPLC System
type: Class
subclass of: detection instrument

automated cytometer
type: Class
subclass of: detection instrument

Hypercyt
type: Class
subclass of: automated cytometer

imaging cytometer
type: Class
IAO_0000115: An imageing cytometer is an instrument for image-based study or measurement of cells. (definition from OBI)
subclass of: automated cytometer

3i Marianas
type: Class
comment: Intelligent Imaging Innovations www.intelligent-imaging.com
subclass of: imaging cytometer

Acumen
type: Class
comment: TTP LabTech http://www.ttplabtech.com/products/acumen/index.html
subclass of: imaging cytometer

ArrayScan VTI HCS Reader
type: Class
comment: Thermo Fisher Scientific www.cellomics.com
subclass of: imaging cytometer

BD Pathway 435
type: Class
comment: BD Biosciences http://www.bdbiosciences.com/instruments/pathway/index.jsp
subclass of: imaging cytometer

BD Pathway 855
type: Class
comment: BD Biosciences http://www.bdbiosciences.com/instruments/pathway/index.jsp
subclass of: imaging cytometer

BioFlux 1000
type: Class
comment: FLUXION http://www.fluxionbio.com/products/bioflux-live-cell-imaging-with-flow/
subclass of: imaging cytometer

Celigo S Imaging Cell Cytometer
type: Class
comment: Brooks Life Science Systems http://www.brooks.com/products/life-science-systems/instruments-and-devices/celigo-cytometer
subclass of: imaging cytometer

Cell Voyager 1000
type: Class
comment: Yokogawa http://www.yokogawa.com/scanner/products/cv1000e.htm
subclass of: imaging cytometer

Cell Voyager 6000
type: Class
comment: Yokogawa http://www.yokogawa.com/hca/product/cv6000.htm
subclass of: imaging cytometer

Cell Voyager 7000
type: Class
comment: Yokogawa http://www.yokogawa.com/hca/product/cv7000.htm
subclass of: imaging cytometer

FlowSight
type: Class
comment: Amnis https://www.amnis.com/documents/brochures/FS_Brochure_Final.pdf
subclass of: imaging cytometer

iCyte Automated Imaging Cytometer
type: Class
comment: CompuCyte http://www.compucyte.com/icyte.htm
subclass of: imaging cytometer

ImageStreamX Mark II Imaging Flow Cytometer
type: Class
comment: Amnis https://www.amnis.com/documents/brochures/ISX-MKII%20Brochure_Final_Web.pdf
subclass of: imaging cytometer

ImageXpress Micro
type: Class
comment: Molecular Devices http://www.moleculardevices.com/Products/Instruments/High-Content-Screening.html
subclass of: imaging cytometer

ImageXpress Ultra
type: Class
comment: Molecular Devices http://www.moleculardevices.com/Products/Instruments/High-Content-Screening.html
subclass of: imaging cytometer

ImageXpress Velos Laser Scanning Cytometer
type: Class
comment: formerly known as: isocyte cytometer Molecular Devices http://www.moleculardevices.com/Products/Instruments/High-Content-Screening.html
subclass of: imaging cytometer

IN Cell Analyzer 2000
type: Class
comment: GE Healthcare http://www.biacore.com/high-content-analysis/index.html
subclass of: imaging cytometer

IN Cell Analyzer 6000
type: Class
comment: GE Healthcare http://www.biacore.com/high-content-analysis/index.html
subclass of: imaging cytometer

Opera
type: Class
comment: Perkin Elmer http://www.perkinelmer.com/pages/020/cellularimaging/products/opera.xhtml
subclass of: imaging cytometer

Operetta
type: Class
comment: Perkin Elmer http://www.perkinelmer.com/pages/020/cellularimaging/products/operetta.xhtml
subclass of: imaging cytometer

Tali Image Cytometer
type: Class
comment: life technologies http://www.invitrogen.com/site/us/en/home/Products-and-Services/Applications/Cell-Analysis/Cellular-Imaging/imaging-cytometry/Tali-Image-Cytometer/Tali-Image-Cytometer-Specifications.html
subclass of: imaging cytometer

ICR 8000 Ion Channel Reader
type: Class
subclass of: detection instrument

MicroBeta TriLux
type: Class
subclass of: detection instrument

SpectraMax Plus384
type: Class
subclass of: detection instrument

LabChip 3000
type: Class
subclass of: detection instrument

Safire
type: Class
subclass of: detection instrument

Infinite F500
type: Class
subclass of: detection instrument

Infinite M1000
type: Class
subclass of: detection instrument

LEADseeker Imaging system
type: Class
subclass of: detection instrument

instrument
type: Class

IN Cell Analyzer 2200
type: Class
comment: GE Healthcare http://www.biacore.com/high-content-analysis/index.html
subclass of: imaging cytometer

IN Cell Analyzer 3000
type: Class
comment: GE Healthcare http://www.biacore.com/high-content-analysis/index.html
subclass of: imaging cytometer

CellWoRx HCS Reader
type: Class
subclass of: imaging cytometer

CellInsight NXT HCS Platform
type: Class
comment: Thermo Fisher Scientific www.cellomics.com
subclass of: imaging cytometer

ArrayScan II HCS Reader
type: Class
comment: Thermo Fisher Scientific Cellomics
subclass of: imaging cytometer

ArrayScan 3.1 HCS Reader
type: Class
comment: Thermo Fisher Scientific Cellomics
subclass of: imaging cytometer

ArrayScan 4.0 HCS Reader
type: Class
comment: Thermo Fisher Scientific Cellomics
subclass of: imaging cytometer

KineticScan HCS Reader
type: Class
comment: Cellomics http://www.bilatec.com/weiterepdf/KinetcScan%20HCS%20Reader.pdf
subclass of: imaging cytometer

microscope
type: Class
subclass of: detection instrument

optical microscope
type: Class
subclass of: microscope

confocal microscope
type: Class
subclass of: microscope

laser scanning confocal microscope
type: Class
subclass of: confocal microscope

spinning-disk confocal microscope
type: Class
subclass of: confocal microscope

laser capture microdissection microscope
type: Class
subclass of: optical microscope

scanning force microscope
type: Class
subclass of: optical microscope

wide-field microscope
type: Class
subclass of: optical microscope

objective lens
type: Class
subclass of: instrument

air interface objective lens
type: Class
subclass of: objective lens

glycerin immersion lens
type: Class
subclass of: objective lens

oil immersion lens
type: Class
subclass of: objective lens

water immersion lens
type: Class
subclass of: objective lens

image acquisition device
type: Class
subclass of: instrument

area detector
type: Class
subclass of: image acquisition device

charge coupled device
type: Class
subclass of: area detector

complementary metal oxide semiconductor
type: Class
subclass of: area detector

electron multiplying charge coupled device
type: Class
subclass of: area detector

spot detector
type: Class
subclass of: image acquisition device

photodiode
type: Class
subclass of: spot detector

photomultiplier tube
type: Class
subclass of: spot detector

light source
type: Class
subclass of: instrument

arc lamp
type: Class
subclass of: light source

mercury-vapor lamp
type: Class
subclass of: arc lamp

xenon lamp
type: Class
subclass of: arc lamp

laser
type: Class
subclass of: light source

diode laser
type: Class
subclass of: laser

dye laser
type: Class
subclass of: laser

gas laser
type: Class
subclass of: laser

ion laser
type: Class
subclass of: gas laser

argon-ion laser
type: Class
subclass of: ion laser

helium-neon laser
type: Class
subclass of: ion laser

krypton-ion laser
type: Class
subclass of: ion laser

mixed argon-krypton gas laser
type: Class
subclass of: ion laser

metal vapor laser
type: Class
subclass of: gas laser

helium-cadmium laser
type: Class
subclass of: metal vapor laser

nitrogen laser
type: Class
subclass of: gas laser

solid state laser
type: Class
subclass of: laser

chromium-doped lithium strontium aluminum fluoride laser
type: Class
subclass of: solid state laser

neodymium-yttrium aluminum garnet laser
type: Class
subclass of: solid state laser

titanium-doped sapphire laser
type: Class
subclass of: solid state laser

light-emitting diode
type: Class
subclass of: light source

tungsten halogen lamp
type: Class
subclass of: light source

IonWorks automated electrophysiology system (Molecular Devices)
type: Class
IAO_0000119: PubChem AID: 2581
IAO_0000116: Date from BAE: 6/26/2016
IAO_0000115: Automated patch clamp systems for ion channel research
IAO_0000119: https://www.moleculardevices.com/systems/automated-electrophysiology
subclass of: detection instrument

Analyst AD (Molecular Devices)
type: Class
IAO_0000119: PubChem AID: 463184
IAO_0000116: Date from BAE: 6/25/2016
IAO_0000115: Assay development system (plate-reader) with four modes: fluorescence, luminescence, absorbance, and Epi-absorbance (Molecular Devices)
subclass of: detection instrument

Axopatch 200B amplifier (Molecular Devices)
type: Class
IAO_0000119: https://www.moleculardevices.com/systems/axon-conventional-patch-clamp/axopatch-200b-amplifier
IAO_0000116: Date from BAE: 6/26/2016
IAO_0000115: An instument for single-channel recoding and whole-cell voltage-clamp recording (Axon Instruments/ Molecular Devices)
IAO_0000119: PubChem AID: 504828
subclass of: detection instrument

Becton Dickinson (BD) LSRII FACS
type: Class
IAO_0000119: PubChem AID: 652043
IAO_0000116: Date from BAE: 5/11/2016
IAO_0000115: The BD LSRII FACS is an air-cooled multi-laser benchtop flow cytometer.
subclass of: detection instrument

Synergy 2 Multi-Mode Reader (BioTek)
type: Class
IAO_0000119: http://www.biotek.com/products/microplate_detection/synergy2_multimode_microplate_reader.html
IAO_0000116: Date from BAE: 6/18/2016
IAO_0000115: The Synergy 2 Multi-Mode Plate Reader's (BioTek) detection modes include fluorescence intensity, fluorescence polarization, time-resolved fluorescence, AlphaScreen, luminescence and UV-visible absorbance.
IAO_0000119: PubChem AID: 652216
subclass of: detection instrument

BMG PHERAstar FSX plate reader (BMG Labtech, Cary NC)
type: Class
IAO_0000119: http://www.bmglabtech.com/en/products/pherastar-fsx/#tab-product-detail
IAO_0000116: Date from BAE: 6/2/2016
IAO_0000115: BMG PHERAstar is a multi-mode benchtop plate reader; FSX and other models (BMG Labtech)
IAO_0000119: PubChem AID: 435018
subclass of: detection instrument

Countess automatic cell counter
type: Class
IAO_0000119: PubChem AID: 588370
IAO_0000116: Date from BAE: 6/1/2016
IAO_0000115: An automated cell counting device: Countess; Countes II FL has fluorescence capabilites (Invitrogen/ ThermoFisher)
IAO_0000119: https://www.thermofisher.com/us/en/home/life-science/cell-analysis/cell-analysis-instruments/automated-cell-counters/countess-ii-fl-automated-cell-counter.html
subclass of: detection instrument

FacSCAN flow cytometer
type: Class
IAO_0000115: A flow cell_based benchtop cytometer (Becton Dickinson (BD))
IAO_0000119: PubChem AID: 1758
IAO_0000116: Date from BAE: 6/24/2016
subclass of: detection instrument

Molecular Devices Vmax plate reader
type: Class
IAO_0000119: PubChem AID: 2649
IAO_0000116: Date from BAE: 6/22/2016
IAO_0000115: A filter-based absorbance platereader for kinetic and endpoint assays (Molecualr Devices)
IAO_0000119: https://www.moleculardevices.com/systems/microplate-readers/absorbance-readers
subclass of: detection instrument

Molecular Devices SpectraMax Plate reader
type: Class
IAO_0000119: PubChem AID: 504388
IAO_0000116: Date from BAE: 6/22/2016
IAO_0000115: Several models of UV-visible absorbance microplate readers: SpectraMax 190; SpectraMax Plus 384; SpectraMax 340PC384 (Molecular Devices)
IAO_0000119: https://www.moleculardevices.com/systems/microplate-readers/absorbance-readers
subclass of: detection instrument

Qpatch automated patch clamp system (Biolin)
type: Class
IAO_0000119: PubChem AID: 623915
IAO_0000116: Date from BAE: 5/13/2016
IAO_0000115: Several models of automated patch clamp systems for studying ion channels: QPatch8, QPAtch16, QpatchHT (Biolin Scientific)
IAO_0000119: http://www.biolinscientific.com/product/qpatch-88x/
subclass of: detection instrument

LightCycler 480 Real-Time PCR detection instrument
type: Class
IAO_0000119: https://lifescience.roche.com/shop/products/lightcycler14301-480-instrument-ii
IAO_0000116: Date from BAE: 6/15/2016
IAO_0000115: One of several models of a plate-based real-time PCR device (Roche )
IAO_0000119: PubChem AID: 651770, 720492
subclass of: detection instrument

Mx3005P RT-PCR instrument (Agilent Technologies)
type: Class
IAO_0000119: http://www.genomics.agilent.com/en/Mx3005P-Mx3000P-qPCR-Instruments-Software/Mx3005P-qPCR-System/
IAO_0000116: Date from BAE: 6/7/2016
IAO_0000115: The Agilent Mx3005P QPCR System, a benchtop RT-PCR plate reader, has been replaced with the AriaMx system (Agilent Technologies)
IAO_0000119: PubChem AID: 2427
subclass of: detection instrument

Synergy HT Multi-Mode Reader (BioTek)
type: Class
IAO_0000119: PubChem AID: 504653
IAO_0000116: Date from BAE: 6/25/2016
IAO_0000115: The Synergy HT (or HTX) is a Multi-Mode Plate Reader (BioTek) is a single-channel absorbance, fluorescence and luminescence microplate reader.
IAO_0000119: http://www.biotek.com/products/microplate_detection/synergy2_multimode_microplate_reader.html
subclass of: detection instrument

GloMax luminometer (Promega)
type: Class
IAO_0000119: PubChem AID: 624302
IAO_0000116: Date from BAE: 6/1/2016
IAO_0000115: One of several models of luminometer, either single-tube to multiple plate readers (Promega). Some models are multimode and can also read fluorescence or absorbance in addition to luminescence )
subclass of: detection instrument

LTQ-Orbitrap Velos (Thermo Scientific)
type: Class
IAO_0000119: PubChem AID: 602339
IAO_0000116: Date from BAE: 6/30/2016
IAO_0000115: A mass spectrometer
subclass of: detection instrument

Appled Biosystems Real-Time PCR System (ThermoFisher)
type: Class
IAO_0000119: PubChem AID: 540282
IAO_0000116: Date from BAE: 7/22/2016
IAO_0000115: Encompasses various models--ABI-9300, ABI-7500, and QuantStudio.
subclass of: detection instrument

Agilent 1100 series LC-MSD SL
type: Class
IAO_0000119: PubChem AID: 602415
IAO_0000116: Date from BAE: 6/30/2016
IAO_0000115: A mass spectrometer
subclass of: detection instrument

VE-2 whole-cell patch clamp amplifier (Alembic Instruments)
type: Class
IAO_0000119: PubChem AID: 2692
IAO_0000116: Date from BAE: 7/4/2016
subclass of: detection instrument

micro-Quant Plate Reader (BioTek)
type: Class
IAO_0000119: PubChem AID: 624061
IAO_0000116: Date from BAE: 7/10/2016
IAO_0000115: A microplate spectrophotometer
subclass of: detection instrument

SpectraMax Gemini XS microplate fluorometer (Molecular Devices)
type: Class
IAO_0000119: PubChem AID: 651896
IAO_0000116: Date from BAE: 7/11/2016
subclass of: detection instrument

Typhoon FLA 9000 laser scanner (GE Healthcare)
type: Class
IAO_0000119: PubChem AID: 602172
IAO_0000116: Date from BAE: 7/1/2016
subclass of: detection instrument

Fluoroskan Ascent FL Microplate Fluorometer and Luminometer (ThermoFisher)
type: Class
IAO_0000119: PubChem AID: 720723
IAO_0000116: Date from BAE: 7/12/2016
subclass of: detection instrument

iMIC platform/ Polychrome V imaging system, (TILL Photonics/ FEI Munic GmbH)
type: Class
IAO_0000119: PubChem AID: 2719
IAO_0000116: Date from BAE: 7/4/2016
subclass of: imaging cytometer

Infinte M200 plate reader (Tecan)
type: Class
IAO_0000119: PubChem AID: 602457
IAO_0000116: Date from BAE: 7/2/2016
subclass of: detection instrument

Multiskan EX plate reader (Thermo Scientific)
type: Class
IAO_0000119: PubChem AID: 720722
IAO_0000116: Date from BAE: 7/12/2016
subclass of: detection instrument

Wallac 1420 (Victor2) Microplate reader (PerkinElmer)
type: Class
IAO_0000119: PubChem AID: 1061
IAO_0000116: Date from BAE: 7/18/2016
subclass of: detection instrument

SpectraFluor Plus Microplate Reader (Tecan)
type: Class
IAO_0000119: PubChem AID: 1745
IAO_0000116: Date from BAE: 7/20/2016
subclass of: detection instrument

TSQ Quantum Triple Quadrupole LC-MS (Thermo Scientific)
type: Class
IAO_0000119: PubChem AID: 602143
IAO_0000116: Date from BAE: 7/8/2016
subclass of: detection instrument

Typhoon Trio variable-mode imager (Amersham/ GE LifeSciences)
type: Class
IAO_0000119: PubChem AID: 623937
IAO_0000116: Date from BAE: 7/19/2016
IAO_0000115: A laser-based scanner that produces digital images of radioactive, fluorescent, or chemiluminescent samples
subclass of: detection instrument

IN Cell Analyzer 1000
type: Class
IAO_0000119: https://www.gelifesciences.com/gehcls_images/GELS/Related%20Content/Files/1314742967685/litdoc28402704_20110831020220.pdf
IAO_0000116: Date from BAE: 7/15/2016
IAO_0000119: PubChem AID: 456
subclass of: imaging cytometer

xCELLigence RTCA DP cellular impedance instrument (Acea Biosciences)
type: Class
IAO_0000119: PubChem AID: 602291
IAO_0000116: Date from BAE: 7/22/2016
IAO_0000115: The xCELLigence RTCA DP instrument uses noninvasive electrical impedance monitoring to quantify cell proliferation, morphology change, and attachment quality in a label-free, real-time manner.
IAO_0000119: http://www.aceabio.com/product/rtca-dp/
subclass of: detection instrument

BD FACSAria flow cytometer (BD Biosciences)
type: Class
IAO_0000119: PubChem AID: 720665
IAO_0000116: Date from BAE: 9/30/2016
subclass of: detection instrument

Biacore 3000 SPR System (GE Healthcare)
type: Class
IAO_0000119: PubChem AID: 651876
IAO_0000116: Date from BAE: 9/30/2016
IAO_0000115: One of several models of surface plasmon resonance (SPR) instruments.
subclass of: detection instrument

ChemiDoc XRS Imaging System (BioRad)
type: Class
IAO_0000119: PubChem AID: 652251
IAO_0000116: Date from BAE: 9/30/2016
IAO_0000115: Imaging system based on CCD high-resolution detection, supports multiple detection methods including fluorescence, colorimetry, densitometry, chemiluminescence, and chemifluorescence.
subclass of: detection instrument

FACScalibur flow cytometer (BD Biosciences)
type: Class
IAO_0000119: PubChem AID: 720663
IAO_0000116: 9Date from BAE: /30/2016
subclass of: detection instrument

FLUOstar Omega microplate reader (BMG Labtech)
type: Class
IAO_0000119: PubChem AID: 623961
IAO_0000116: Date from BAE: 9/30/2016
subclass of: detection instrument

Pico patch clamp amplifier (Tecella)
type: Class
IAO_0000119: PubChem AID: 623974
IAO_0000116: Date from BAE: 9/30/2016
subclass of: detection instrument

Storm PhosphorImager (Molecular Dynamics/ GE)
type: Class
IAO_0000119: PubChem AID: 2704
IAO_0000116: Date from BAE: 9/30/2016
IAO_0000115: An imaging system for blots, gels, etc, to replace use of film; can be used for autoradiography, fluorescence, and chemifluorescence imaging.
subclass of: detection instrument

Varioskan LUX multimode microplate reader (ThermoFisher)
type: Class
IAO_0000119: PubChem AID: 623970
IAO_0000116: Date from BAE: 9/30/2016
subclass of: detection instrument

Velos-MS
type: Class
subclass of: detection instrument

NGS Instrument
type: Class
subclass of: 8453 UV-Visible Spectrophotometer

Odyssey Plate Reader
type: Class
subclass of: Analyst HT

Luminex 200 Flow Cytometer
type: Class
IAO_0000115: The Luminex 100/200 System is the combination of three core xMAP® Technologies. The first is xMAP microspheres, a family of fluorescently dyed micron-sized polystyrene microspheres that act as both the identifier and the solid surface to build the assay. The second is a flow cytometry-based instrument, the Luminex 100/200 analyzer, which integrates key xMAP detection components, such as lasers, optics, fluidics, and high-speed digital signal processors. The third component is the xPONENT® software, which is designed for protocol-based data acquisition with robust data regression analysis. From https://www.luminexcorp.com/research-luminex-100200/
subclass of: detection instrument

Luminex 200 Flow Cytometer
type: Class
IAO_0000115: The Luminex 200 system is a compact analyzer that performs up to 100 immunoassays simultaneously using a single drop of fluid.
subclass of: detection instrument
deprecated: true

FlexStation III Microplate Reader
type: Class
IAO_0000115: The FlexStation 3 Multi-Mode Microplate Reader measures absorbance, fluorescence intensity, fluorescence polarization, luminescence, and time-resolved fluorescence for biochemical and cell-based assays. The reader adds up to three transfers of assay reagents from a 96- or 384-well source plate to enhance assay design using integrated fluidics.
IAO_0000118: FlexStation 3
subclass of: detection instrument

IN Cell Analyzer 2500
type: Class
IAO_0000115: IN Cell Analyzer 2500HS is a widefield high-content imaging system equipped with deconvolution.
subclass of: detection instrument

IN Cell Analyzer 6500
type: Class
IAO_0000115: IN Cell Analyzer 6500HS is a laser-based high-content imaging system featuring IRIS confocal technology.
subclass of: detection instrument

Spectramax L
type: Class
subclass of: instrument

PHERAstar FSX
type: Class
subclass of: instrument