BioAssay Ontology
type: Ontology
license: https://creativecommons.org/licenses/by-sa/4.0/
version info: 2.7.2
label: BAO
comment: Created by: Hande Küçük McGinty, Janice Kranz, Joseph Ostrow, Alex Clark, Yu Lin, Saminda Abeyruwan, Uma Vempati, Kunie Sakurai, Vance Lemmon, Ubbo Visser, John Turner, Stephan Schurer*
comment: Contact: Stephan Schurer stephan dot schurer at gmail dot com
date: 8 Jul 2021

molecular function
type: Class
deprecated: true
subclass of: function

function
type: Class