BioAssay Ontology
type: Ontology
license: https://creativecommons.org/licenses/by-sa/4.0/
version info: 2.8.15
label: BAO
comment: Created by: Caty Chung, Nicolette Ross, Joan Glenny-Pescov, Jiaming Hu, Stephan Schurer*
comment: Contact: Stephan Schurer stephan dot schurer at med dot miami dot edu
date: May 30, 2025

fluorescence resonance energy transfer
type: Class
IAO_0000118: FRET
IAO_0000115: Fluorescence resonance energy transfer (FRET) is based on the transfer of energy between two fluorophores, a donor and an acceptor, when in close proximity. The energy transfer is directed from higher-energy donor fluorophore to lower-energy acceptor fluorophore of labeled protein pairs. Target protein pairs are likely to exhibit FRET if they are no more than 10 nm apart.
subclass of: fluorescence method

homogeneous time resolved fluorescence
type: Class
IAO_0000118: HTRF
IAO_0000115: Homogenous time resolved fluorescence (HTRF) is a technology which combines standard FRET technology with the time-resolved measurement of fluorescence. Through this, HTRF eliminates the short-lived background fluorescence. Introducing a time delay (50-150 micro seconds) between the system excitation and fluorescence measurement, which allows the signal to be cleared of all non-specific short lived emissions.
subclass of: fluorescence resonance energy transfer

fluorescence polarization
type: Class
IAO_0000118: FP
IAO_0000115: Fluorescence polarization (FP) measurements are based on the assessment of the rotational motions of species. It is used to measure binding interactions. When linear polarized light is used to excite fluorophores, only those aligned with the plane of polarization will be excited. For fluorophores attached to small, rapidly rotating molecules, the initially photoselected orientational distribution becomes randomized prior to emission, resulting in low fluorescence polarization. But binding of the low molecular weight tracer to a large, slowly rotating molecule results in high fluorescence polarization.
subclass of: fluorescence method

time resolved fluorescence resonance energy transfer
type: Class
IAO_0000118: TR-FRET
IAO_0000115: Time resolved-fluorescence resonance energy transfer (TR-FRET) unites TRF (Time-Resolved Fluorescence) and FRET (Fluorescence Resonance Energy Transfer) principles. This combination brings together the low background benefits of TRF with the homogeneous assay format of FRET. Introducing a time delay (50-150 micro seconds) between the system excitation and fluorescence measurement allows the signal to be cleared of all non-specific short lived emissions. TR-FRET uses lanthanide donors which are fluorophores with long emission half-lives.
subclass of: fluorescence resonance energy transfer

flow cytometry
type: Class
subclass of: fluorescence method
IAO_0000118: FACS
IAO_0000118: Fluorescence-activated cell sorting
IAO_0000115: Flow cytometry uses the principles of light scattering and fluorescence from fluorochrome molecules to generate specific multi-parameter data from particles and cells in the size range of 0.5um to 40um diameter.
IAO_0000118: flow cytometry assay
IAO_0000118: FACS assay

scintillation proximity assay
type: Class
IAO_0000118: SPA
IAO_0000115: Scintillation proximity assay (SPA) eliminates the separation step of unbound radioisotopes and is performed using low energy radioisotopes (3H and 125I) as labels, which have short range electron emission. SPA involves the use of microscopic beads which are first coated with a receptor protein of interest and contain a scintillant. When stimulated by the binding of radio-labeled ligand molecules, they emit light, which is detected by the photomultiplier tube. SPA is suitable for high throughput since the protocol has no wash or separation steps.
subclass of: BAO_0002776
IAO_0000116: [EdgeRewiring: BAO v 2.8.14 (April 2025)]

physical detection method
type: Class
IAO_0000115: The physical method (technology) used to measure / readout the effect caused by a perturbagen in the assay environment.

luminescence method
type: Class
IAO_0000115: The emission of light from a substance that occurs from an electronically excited state which is reached either by a physical, mechanical, or chemical mechanism.
subclass of: physical detection method

fluorescence method
type: Class
IAO_0000115: Detection techniques that use the principles of fluorescence, whereby incident light excites a fluorophore which then emits light at lower energy (higher wavelength). The emitted light is typically from the visible portion of the UV-Visible spectrum.
subclass of: physical detection method

spectrophotometry method
type: Class
IAO_0000115: Spectrophotometry involves the use of a spectrophotometer to measure the amount of light that a sample absorbs. The instrument operates by passing a beam of light through a sample and measuring the intensity of light reaching a detector.
subclass of: physical detection method

bioluminescence
type: Class
IAO_0000115: Bioluminescence refers to the production and emission of light by a living organism. Bioluminescence is a naturally occurring form of chemiluminescence whereby energy is released by a chemical reaction in the form of light emission. The chemical reaction can occur either inside or outside the cell, and can be detected using a plate reader or a charge-coupled device (CCD) camera.
subclass of: luminescence method

chemiluminescence
type: Class
IAO_0000115: Chemiluminescence is the generation of light as a result of a chemical reaction using synthetic compounds and usually involving a highly oxidized species such as peroxide.
subclass of: luminescence method

surface plasmon resonance
type: Class
IAO_0000118: SPR
IAO_0000115: For surface plasmon resonance measurements, target protein is immobilized onto a solid surface via covalent or noncovalent interaction. Binding of small molecule compounds changes the refractive index of the immobilized target, which can be detected by optical sensing. Shift in wavelength of light is proportional to mass changes near the sensor surface, with sensitivity to detect mass change being ~300 Da.
subclass of: optical based

mass spectrometry
type: Class
IAO_0000118: MS
IAO_0000115: This method is used to detect compounds that are bound to the protein targets. The unbound compounds are separated by affinity based, size exclusion, or ultrafiltration methods. The bound compounds are eluted from the protein and detected by mass spectrometry. Based on the separation method, the throughput varies: between 200-2700 compounds can be loaded in each run for separation. Mass spectrometry is used to determine the chemical structure of molecules. The samples are vaporized, followed by ionization and then the mass to charge ratio of the particles is analyzed.
subclass of: physical detection method

optical based
type: Class
IAO_0000115: These biosensors employ evanescent waves (surface plasmon resonance, resonant waveguide grating) or interference of light waves to characterize the cellular processes that are taking place at or near the sensor surface: e.g. to study the affinity of a sample to the biological receptors immobilized on the sensor surface.
subclass of: label free method

thermal shift
type: Class
IAO_0000115: Upon heating, a protein unfolds and loses the native conformation. Binding of a small molecule can often stabilize the protein conformation, resulting in a higher unfolding temperature. The temperature shift in unfolding can be detected using a fluorescent dye, which is sensitive to the protein environment.
subclass of: fluorescence method

current clamp
type: Class
IAO_0000115: The current clamp technique is used to measure biological voltages such as the action potential of an excitable cell with a microelectrode while keeping electrical current through the recording electrode constant. It can be used for both extracellular and intracellular recordings.
subclass of: microelectrode measurement

impedance
type: Class
IAO_0000115: Impedance biosensors measure the electrical opposition of an interface in AC steady state with constant DC bias conditions. This is accomplished by imposing a small sinusoidal voltage at a particular frequency and measuring the resulting current; the process can be repeated at different frequencies. The current-voltage ratio gives the impedance.
subclass of: BAO_0080046
IAO_0000116: [EdgeRewiring: BAO v 2.8.14 (April 2025)]

patch clamp
type: Class
IAO_0000115: The patch clamping technique is refined from the voltage clamp technique, wherein a blunt electrode is placed on the surface of the cell membrane. It is a common intracellular recording technique in electrophysiology that allows either the measurement of current passing through individual ion channels in cells or through whole cells. Suction is applied via the blunt electrode (glass pipette in classical patch clamp technique) to create a high resistance (gigaohm) between the electrode and cell surface. This seal isolates the ion channels within the patch from the rest of the membrane and allows the neurophysiologist to record only from these ion channels.
subclass of: microelectrode measurement

voltage clamp
type: Class
IAO_0000115: The voltage clamp technique is used to measure the ion currents across an excitable cell membrane, such as neuronal membrane, while holding the membrane voltage at a constant level. The neuronal membrane contains different kinds of ion channels including voltage gated ion channels. Manipulation of the membrane voltage using voltage clamping allows the current-voltage relationships of these ion channels to be studied.
subclass of: microelectrode measurement

total internal reflection fluorescence microscopy
type: Class
IAO_0000115: This technique probes the surface of fluorescently-labeled living cells with an evanescent wave generated by a light beam traveling between two media of differing refractive indices. An incident laser beam is reflected at a critical angle (total internal reflection) when it encounters the interface between a microscope glass slide and the aqueous medium containing the cells. Only fluorophores which are within a few nanometers of the surface are excited, while those farther away are not, making possible the study the interactions at the cell surface.
subclass of: fluorescence microscopy

bio layer interferometry
type: Class
IAO_0000118: BLI
IAO_0000115: Bio-Layer Interferometry is a used for measuring biomolecular interactions. In this technique, the interference pattern of white light reflected from two surfaces: a layer of immobilized protein on the biosensor tip, and an internal reference layer are analyzed. Changes in the number of molecules bound to the biosensor tip cause a shift in the interference pattern, which can be measured in real-time.
subclass of: optical based

fiber optic waveguide
type: Class
IAO_0000115: It is based on the ability of a transparent substance, such as glass to conduct some of the visible or near-visible light to its interior by means of internal reflection.
subclass of: optical based

optical waveguide grating
type: Class
IAO_0000115: The optical grating coupler sensor responds to the change of optical refractive index of the liquid or gas cover medium and to the adsorption or binding of molecules on the surface. The optical grating coupler sensor chip is based on a fine optical grating prepared on a thin waveguide layer carried by a glass substrate. The optical grating couples the light of a He-Ne laser at a given resonance angle into the waveguide layer. This incoupling angle is very sensitive to the presence of adsorbed molecules and to any change of refractive index of the medium covering the surface of the chip. By precise measurement of the incoupling angle, the amount of the adsorbed material can be determined with ultra high sensitivity.
subclass of: optical based

resonant waveguide grating
type: Class
IAO_0000118: RWG
IAO_0000115: Cells are directly cultured onto the surface of a resonant waveguide grating (RWG) biosensor. The mass redistribution within the bottom portion of cells, mediated by stimulus is directly measured with the biosensor. RWG biosensor utilizes an optical beam with an appropriate angular content to illuminate a waveguide film in which a grating structure is embedded. When this beam is reflected by the sensor surface, the resonant angle dominates in the output beam. The mass redistribution within the sensing volume alters the incident angle. Because of its ability for multiparameter measurements, the biosensor has potential to provide high information content for cell sensing. These parameters include the angular shift (one of the most common outputs), the intensity, the peak width at half-maximum (PWHM), and area of the resonant peaks.
subclass of: optical based

absorbance
type: Class
IAO_0000115: The absorbance of a beam of collimated monochromatic radiation in a homogeneous isotropic medium is proportional to the absorption path length and to the concentration of the absorbing species. Absorbance is a logarithmic measure of the amount of light (at a specific wavelength) that is absorbed when passing through a sample. A= -log10(I/I0), where A is absorbance, I is the intensity of incident light and I0 is the intensity of light transmitted after passing through the sample.
subclass of: spectrophotometry method

transmittance
type: Class
IAO_0000115: The transmittance of a sample is the ratio of the intensity of the light that has passed through the sample to the intensity of the light when it entered the sample (T = Iout / Iin ). To convert between the absorbance and transmittance scales, the following equation is used: A = -log T = - log (I / Io).
subclass of: spectrophotometry method

alphascreen
type: Class
IAO_0000115: This technology measures the interaction of two molecules bioconjugated to donor and acceptor beads. Laser excitation leads to light emission which is directly proportional to the amount of binding, provided molecules are in proximity to cause a chemical reaction (interact). Users have modified this and coupled it to chemiluminescence emission. This technology has been adapted to study protein-protein, protein-DNA and receptor-ligand, immunoassay, phosphorylation and protease reactions.
subclass of: luminescence method

nuclear magnetic resonance
type: Class
IAO_0000118: NMR
IAO_0000115: Nuclear magnetic resonance (NMR) is used to analyze protein-small molecule interactions. This binding interaction is commonly monitored by the chemical shift of the compound. With this technique, both the binding interaction and bound compounds can be detected, which allows pools of 5-100 compounds to be tested for binding.
subclass of: label free method

circular dichroism
type: Class
IAO_0000118: CD
IAO_0000115: Circular dichroism (CD) is a technology for assessing interactions of chiral molecules with circularly polarized electromagnetic rays. Secondary and tertiary structure of proteins will impart a distinct CD to that molecule allowing the use of CD to examine the protein folding under different conditions. Information about conformational properties of nucleic acids can be obtained by CD spectroscopy.
subclass of: label free method

electrical sensor
type: Class
IAO_0000115: Electrical sensors are used to measure the electrical impedance, or the current-voltage relationships of these ion channels.
subclass of: label free method

fluorescence intensity
type: Class
IAO_0000115: Fluorescence intensity is the measure of fluorescence from a sample.
subclass of: fluorescence method

microelectrode measurement
type: Class
IAO_0000115: Electrically active cells, such as neurons, muscle and endocrine cells undergo changes in membrane potential due to depolarization and hyperpolarization as a result of opening and closing of ion channels. The electrical recordings from these cells are obtained by the insertion or attaching microelectrodes to these cells. Patch clamp, voltage clamp and current clamp are three ways of studying the current-voltage relationships of these ion channels.
subclass of: electrical sensor

filter assay
type: Class
IAO_0000115: This assay is performed to study interaction between a radio-labeled ligand and the receptor. The reaction mixture containing the receptor and radioligand is transferred to a filter plate, washed to remove the unbound radioligand. The bound complex remains on the filter, which can be eluted into the scintillation fluid and the radioactivity measured. Filter assays differ from SPA because a separation of free radioligand and radioligand bound to the receptor is required for measurement.
subclass of: BAO_0002989
IAO_0000116: [EdgeRewiring: BAO v 2.8.14 (April 2025)]

x ray crystallography
type: Class
IAO_0000115: X-ray crystallography is used to analyze protein-small molecule interactions. This binding interaction is monitored by measuring the difference of diffraction between protein-compound binding complex and protein alone. With this technique, both the binding interaction and bound compounds can be detected, which allows pools of 5-100 compounds to be tested for binding.
subclass of: label free method

scintillation counting
type: Class
IAO_0000115: It involves the incorporation of radiolabeled precursors into uniform distribution with a liquid medium capable of converting the kinetic energy of nuclear emissions into light energy. A scintillation counter is used to measure ionizing radiation. The scintillation counter consists of a sensor, called a scintillator, made of transparent crystal or an organic liquid that fluoresces when struck by ionizing radiation. A photomultiplier is then used to measure the light emitted by the sensor and is attached to an electronic apparatus that amplifies and quantifies the radiation signal.
subclass of: radiometry method

lysate based
type: Class
IAO_0000115: This assay is performed to study interaction between a radio-labeled ligand and the receptor in presence of cold ligand. The cells exposed to the radioligand and cold ligand are washed to remove the unbound ligands. They are then lysed and the bound radioactivity is counted in a liquid scintillation counter.
subclass of: BAO_0000220
IAO_0000116: [EdgeRewiring: BAO v 2.8.14 (April 2025)]

label free method
type: Class
IAO_0000115: It allows the detection of binding interactions and cell-based reactions without the need to use conventional labels, e.g., fluorescent probes. The advantages include the ability to measure a) functional activity without modifying the binding partners with labels, b) binding interactions independent of functional activity, and c) cell-Based GPCR assays without the need for engineering cell-lines to over-express given receptors.
subclass of: physical detection method

isothermal titration calorimetry
type: Class
IAO_0000118: ITC
IAO_0000115: ITC is a thermodynamic technique that can directly measure the heat released or absorbed during a biomolecular binding event. It can measure the binding affinity (Ka), reaction stoichiometry (n), enthalpy (∆H) and entropy (ΔS) of the interaction between two or more molecules in solution.</obo:IAO_0000115>
subclass of: label free method

electron microscopy
type: Class
IAO_0000118: EM
IAO_0000115: Electron microscopy involve the diffraction, reflection, or refraction of electron beams interacting with the subject of study, and the subsequent collection of this scattered radiation in order to build up an image.
subclass of: microscopy

fluorescence microscopy
type: Class
IAO_0000115: Fluorescence microscopy is used to image the distribution of molecules based on the properties of fluorescence emission. Excitation of fluorescent molecules with a specific wavelength results in the production of an image by the secondary fluorescence emission at longer wavelengths.
subclass of: optical microscopy

optical microscopy
type: Class
IAO_0000115: Optical or light microscopy involves passing visible light transmitted through or reflected from the sample through a single or multiple lenses to allow a magnified view of the sample
subclass of: microscopy

imaging method
type: Class
IAO_0000115: The field of using microscopes to see objects that cannot be seen with the unaided eye.
subclass of: physical detection method

confocal microscopy
type: Class
IAO_0000115: Confocal microscopy has advantages over widefield optical microscopy, including the ability to eliminate or reduce background information away from the focal plane and collect serial optical sections from thick specimens. It uses point illumination and a spatial pinhole to eliminate out-of-focus light in specimens that are thicker than the focal plane.
subclass of: optical microscopy

scanning electron microscopy
type: Class
IAO_0000118: SEM
IAO_0000115: Scanning electron microscopy (SEM) visualizes details on the surfaces of cells and particles and gives a very nice 3D view. It gives results much like those of the stereo light microscope, and, akin to that, its most useful magnification is in the lower range than that of the transmission electron microscope.
subclass of: electron microscopy

transmission electron microscopy
type: Class
IAO_0000118: TEM
IAO_0000115: Transmission electron microscopy (TEM) is quite similar to the compound light microscope, by sending an electron beam through a very thin slice of the specimen. The resolution limit in 2005 was approximately 0.05 nanometer and has not increased appreciably since that time.
subclass of: electron microscopy

quartz crystal microbalance
type: Class
IAO_0000118: QCM
IAO_0000115: Quartz crystal microbalance (QCM) technology is based on measuring the resonant frequency of piezoelectric quartz crystals. It allows measurement of important cellular parameters such as adhesion, proliferation and cytotoxicity. It is also used for the identification of protein ligands by immobilized receptors.
subclass of: label free method

brightfield microscopy
type: Class
IAO_0000115: In brightfield microscopy, sample is illuminated with transmitted white light from below and observed from above.
subclass of: optical microscopy

phase contrast microscopy
type: Class
IAO_0000115: Phase contrast microscopy shows differences in refractive index as difference in contrast. Regions with higher contrast, e.g. nuclei, appear darker than the surrounding cytoplasm.
subclass of: optical microscopy

scanning probe microscopy
type: Class
IAO_0000115: It forms images of surfaces using a physical probe that scans the specimen and measuring on a fine scale, down to the level of molecules and groups of atoms. The resolution is not limited by the diffraction, but by the size of probe-sample interaction volume. Atomic force microscopy (AFM), scanning tunneling microscopy (STM), and near-field scanning optical microscopy (NSOM) are the three common scanning probe techniques.
subclass of: microscopy

bioluminescence resonance energy transfer
type: Class
IAO_0000118: BRET
IAO_0000115: BRET is similar to FRET but has a bioluminescent protein such as aequorin as the donor and a fluorescent acceptor, e.g. GFP. The donor emits blue light in the absence of GFP, but when GFP and aequorin are associated as they are in vivo, GFP accepts the energy from aequorin and emits green light. Hence BRET eliminates the disadvantages associated with donor fluorophore activation.
subclass of: bioluminescence

chemiluminescence resonance energy transfer
type: Class
IAO_0000118: CRET
IAO_0000115: Chemiluminescence resonance energy transfer (CRET) is a resonance energy transfer between chemiluminescent donors and fluorescent acceptors. CRET occurs by the oxidation of a luminescent substrate, such as luminol/hydrogen peroxide reaction catalyzed by horseradish peroxidase. CRET eliminates the disadvantages associated with donor fluorophore activation.
subclass of: chemiluminescence

carbon nanotube based sensor
type: Class
IAO_0000115: Carbon nanotubes (CNT) are rolled up seamless cylinders of graphene sheets, exhibiting many unique physical, mechanical and chemical properties. CNT based biosensors are used to detect protein interactions, e.g. protein-DNA, antibody-aptamer interaction, etc.
subclass of: electrical sensor

radiometry method
type: Class
IAO_0000115: Detection technology using radioactive tracers, e.g. filter assay, SPA, etc
subclass of: physical detection method

dark field microscopy
type: Class
subclass of: optical microscopy

differential interference contrast microscopy
type: Class
subclass of: optical microscopy

scanning near-field optical microscopy
type: Class
subclass of: optical microscopy

vibrational spectroscopic imaging
type: Class
subclass of: optical microscopy

Raman imaging
type: Class
subclass of: vibrational spectroscopic imaging

infrared imaging
type: Class
subclass of: vibrational spectroscopic imaging

near-infrared imaging
type: Class
subclass of: infrared imaging

mid-infrared imaging
type: Class
subclass of: infrared imaging

atomic force microscopy
type: Class
subclass of: scanning probe microscopy

scanning tunneling microscopy
type: Class
subclass of: scanning probe microscopy

tomography
type: Class
subclass of: imaging method

microscopy
type: Class
subclass of: imaging method

autoradiography
type: Class
subclass of: radiometric imaging method
IAO_0000116: [EdgeRewiring: BAO v 2.8.14 (April 2025)]

phosphorimaging
type: Class
IAO_0000115: The use of photostimulated luminescence to make a form of X-ray image.
subclass of: radiometric imaging method
IAO_0000116: [EdgeRewiring: BAO v 2.8.14 (April 2025)]

atomic absorption spectrophotometry
type: Class
subclass of: spectrophotometry method

visual observation method
type: Class
IAO_0000119: PubChem AID: 687012
IAO_0000116: Date from BAE: 9/30/2016
IAO_0000115: Any method entailing primarily routine examination, requiring no special instrumentation.
subclass of: physical detection method

simple measurement method
type: Class
IAO_0000119: PubChem AID: 687012
IAO_0000116: Date from BAE: 9/30/2016
IAO_0000115: Any method entailing basic measurements that require no special instrumentation. Examples are measuring a tumor size using calipers, or a subject's weight using a scale.
subclass of: physical detection method

Cherenkov counting method
type: Class
IAO_0000115: Cherenkov counting can be used for detection of hard beta-emitting radionuclides via LSC, but its counting efficiency is sensitive to color quench, and depends on the emitted ß-energy, the sample volume and its concentration, the type of counting vial, rthe efractive index and the type of photocathode.
submitted by: Opioid Drug Ontology (ODO) (https://opioiddrugontology.github.io/) - Nicolette Ross (https://orcid.org/0000-0002-4677-2140)
IAO_0000119: https://doi.org/10.3390/ma14216719
subclass of: scintillation counting
IAO_0000116: [DefinitionUpdate: BAO v 2.8.15 (May 2025)] [NodeCreation: BAO v 2.8.13 (March 2025)]

radiometric imaging method
type: Class
IAO_0000115: Radiometric imaging techniques are methods used to create images by detecting the decay of radiolabeled atoms, enabling accurate visualization of the distribution of radioactive atoms on two-dimensional (2D) surfaces.
subclass of: radiometry method
submitted by: Opioid Drug Ontology (ODO) (https://opioiddrugontology.github.io/) - Nicolette Ross (https://orcid.org/0000-0002-4677-2140)
IAO_0000119: https://doi.org/10.1016/B978-012379777-3/50005-4
IAO_0000116: [DefinitionUpdate: BAO v 2.8.15 (May 2025)] [NodeCreation: BAO v 2.8.13 (March 2025)]

radiometry separation method
type: Class
IAO_0000115: Method used to separate excess free ligand must be separated rapidly from the bound receptor-ligand complex.
subclass of: BAO_0002500
submitted by: Opioid Drug Ontology (ODO) (https://opioiddrugontology.github.io/) - Nicolette Ross (https://orcid.org/0000-0002-4677-2140)
IAO_0000116: [DefinitionUpdate: BAO v 2.8.15 (May 2025)] [NodeCreation: BAO v 2.8.13 (March 2025)]

organ bath method
type: Class
IAO_0000115: Traditionally, tissue-organ baths are used for in vitro dose response experiments, used extensively to investigate the physiology and pharmacology of tissue preparations (ring/vessel or strip) from various species (chick, toad, rabbit, rat, guinea-pig, etc.). Tissues or organs have been isolated for these studies include muscle (Smooth or Skeletal), arterial rings or strips, uterine tissue or Vas deferens, ileum, colon, atrial or Ventricle and diaphragm. Typically, these experiments are performed in a temperature controlled environment and perfused with an oxygenated physiological solution, which allows the study of evoked tissue responses to pharmacological drug/agents (Dose Response studies), electrical stimulation or both pharmacological and electrical stimulation.The recorded responses or biological activity usually are the contraction/relaxation of muscle in the tissue: Force (isometric), Displacement (isotonic).
subclass of: BAO_0002202
submitted by: Opioid Drug Ontology (ODO) (https://opioiddrugontology.github.io/) - Nicolette Ross (https://orcid.org/0000-0002-4677-2140)
IAO_0000116: [DefinitionUpdate: BAO v 2.8.15 (May 2025)] [NodeCreation: BAO v 2.8.13 (March 2025)]

electrical stimulation method
type: Class
IAO_0000115: Electrical field stimulation, in which the stimulating current is applied uniformly to the tissue, is useful in several experimental situations. All muscle cells are simultaneously, directly, and nearly equally stimulated. Since each cell is excited without the necessity of propagation, field stimulation ensures that all cells become activated in visceral smooth muscle, despite possible lability of cell-to-cell transmission or decremental propagation, and in normally nonpropagating multiunit smooth muscles. When recording contraction of isolated smooth muscles, field stimulation enables the maximal (for a given set of conditions) isometric developed tension to be recorded because all cells are simultaneously in their active state, and the lack of longitudinal propagation minimizes the passive series elastic element contribution from uncontracted cells in series with contracted cells.
subclass of: organ bath method
submitted by: Opioid Drug Ontology (ODO) (https://opioiddrugontology.github.io/) - Nicolette Ross (https://orcid.org/0000-0002-4677-2140)
IAO_0000119: https://link.springer.com/chapter/10.1007/978-1-4684-2751-6_16
IAO_0000116: [DefinitionUpdate: BAO v 2.8.15 (May 2025)] [NodeCreation: BAO v 2.8.13 (March 2025)]

gamma counting method
type: Class
IAO_0000115: Method used for the detection of for detecting gamma radioaction emissions.
subclass of: scintillation counting
submitted by: Opioid Drug Ontology (ODO) (https://opioiddrugontology.github.io/) - Nicolette Ross (https://orcid.org/0000-0002-4677-2140)
IAO_0000119: https://doi.org/10.1177/000456328001700101
IAO_0000116: [DefinitionUpdate: BAO v 2.8.15 (May 2025)] [NodeCreation: BAO v 2.8.13 (March 2025)]

centrifugation
type: Class
IAO_0000115: A process where a rotating machine exposes a specimen to centrifugal force. This process can be used to remove moisture from a specimen, to subject an organism to increased gravitational forces, or to separate the components of heterogeneous mixtures based on density differences.
subclass of: BAO_0002500
submitted by: Opioid Drug Ontology (ODO) (https://opioiddrugontology.github.io/) - Nicolette Ross (https://orcid.org/0000-0002-4677-2140)
IAO_0000119: https://www.eionet.europa.eu/gemet/en/concept/1262
IAO_0000116: [DefinitionUpdate: BAO v 2.8.15 (May 2025)] [NodeCreation: BAO v 2.8.13 (March 2025)]

filter assay method
type: Class
IAO_0000115: Procedures used in binding assays for separation of bound and free ligands.
subclass of: BAO_0002500
submitted by: Opioid Drug Ontology (ODO) (https://opioiddrugontology.github.io/) - Nicolette Ross (https://orcid.org/0000-0002-4677-2140)
IAO_0000119: https://doi.org/10.1002/jnr.490080405
IAO_0000116: [DefinitionUpdate: BAO v 2.8.15 (May 2025)] [NodeCreation: BAO v 2.8.13 (March 2025)]

dextran-coated charcoal method
type: Class
IAO_0000115: In ligand binding assays and immunoassays, dextran-coated charcoal is commonly used to separate free ligands or hormones from their bound forms, such as antibody-bound hormones. Dextran "coats" the charcoal, creating a sieve-like surface that facilitates this separation. This method is particularly used in immunoassays to distinguish free hormones from those bound to antibodies. Studies have also explored how small molecules interact with charcoal alone or when mixed with substances like dextran, albumin, immunoglobulin (IgG), or insulin to better understand the mechanism of differential adsorption.
subclass of: BAO_0002500
submitted by: Opioid Drug Ontology (ODO) (https://opioiddrugontology.github.io/) - Nicolette Ross (https://orcid.org/0000-0002-4677-2140)
IAO_0000119: https://doi.org/10.1080/15321818208056986
IAO_0000116: [DefinitionUpdate: BAO v 2.8.15 (May 2025)] [NodeCreation: BAO v 2.8.13 (March 2025)]

proximity-based method
type: Class
IAO_0000115: A proximity-based method is a biophysical approach used to monitor the spatial closeness of proteins or molecules within live cells by exploiting measurable signals generated through interactions, such as energy transfer, between tagged molecular components. For example, techniques like Bioluminescence Resonance Energy Transfer (BRET) utilize the transfer of energy from a donor enzyme (e.g., luciferase) to an acceptor fluorophore, resulting in a quantifiable signal that denotes proximity. These methods are widely applied to study protein-protein interactions, protein-ligand interactions, receptor proximity, and intracellular signaling. Advances in technologies such as NanoBRET and NanoBiT have further expanded the utility and scope of proximity-based methods for various biological applications.
subclass of: physical detection method
submitted by: Opioid Drug Ontology (ODO) (https://opioiddrugontology.github.io/) - Nicolette Ross (https://orcid.org/0000-0002-4677-2140)
IAO_0000119: https://doi.org/10.3389/fbioe.2019.00056
IAO_0000116: [DefinitionUpdate: BAO v 2.8.15 (May 2025)] [NodeCreation: BAO v 2.8.13 (March 2025)]

micturition assessment method
type: Class
IAO_0000115: The micturition assessment method is a technique used to evaluate bladder emptying rates and overall bladder motility.
subclass of: BAO_0002202
submitted by: Opioid Drug Ontology (ODO) (https://opioiddrugontology.github.io/) - Nicolette Ross (https://orcid.org/0000-0002-4677-2140)
IAO_0000119: https://doi.org/10.1211/002235702397
IAO_0000116: [DefinitionUpdate: BAO v 2.8.15 (May 2025)] [NodeCreation: BAO v 2.8.13 (March 2025)]

gut transit method
type: Class
IAO_0000115: The gut transit method is a technique used to evaluate gut function by tracking the movement of a substance through the gastrointestinal tract.
subclass of: BAO_0002202
submitted by: Opioid Drug Ontology (ODO) (https://opioiddrugontology.github.io/) - Nicolette Ross (https://orcid.org/0000-0002-4677-2140)
IAO_0000119: https://doi.org/10.1038/s41598-018-23717-4
IAO_0000116: [DefinitionUpdate: BAO v 2.8.15 (May 2025)] [NodeCreation: BAO v 2.8.13 (March 2025)]

electrical impedance measurement
type: Class
IAO_0000115: Electrical impedance measurement involves determining the difference (delta change) between the applied voltage and the corresponding current.
subclass of: BAO_0002202
submitted by: Opioid Drug Ontology (ODO) (https://opioiddrugontology.github.io/) - Nicolette Ross (https://orcid.org/0000-0002-4677-2140)
IAO_0000119: https://doi.org/10.1016/B978-0-323-98337-2.00012-2
IAO_0000116: [DefinitionUpdate: BAO v 2.8.15 (May 2025)] [NodeCreation: BAO v 2.8.13 (March 2025)]

isometric tension recording method
type: Class
IAO_0000115: Isometric tension recording is a technique used to measure tension.
subclass of: physical detection method
submitted by: Opioid Drug Ontology (ODO) (https://opioiddrugontology.github.io/) - Nicolette Ross (https://orcid.org/0000-0002-4677-2140)
IAO_0000119: https://doi.org/10.1007/s11302-024-09993-y
IAO_0000116: [DefinitionUpdate: BAO v 2.8.15 (May 2025)] [NodeCreation: BAO v 2.8.13 (March 2025)]